{"text_format":"1","workbook":"xlsx","n_sheets":4,"sheets":["Instructions","MRTS Clearing TPSSOLVE","MRTS Clearing FINALSOLVE","Framework (Current vs MRTS)"],"not_rendered":{"charts":1,"images":0,"macros":1,"external_links":0,"defined_names":4,"comments":2,"pivot_tables":0},"unopened":[],"bounds":{"document_bytes":16777216,"sheet_cells":100000,"rows_first":2000,"rows_last":500,"rows_between":2000,"halvings":0,"cell_chars":16384,"cell_head_chars":4096},"cells_cut":0,"cells_raw":0,"read":"whole","date_system":"1900"}

{"sheet":"Instructions","index":0,"n_rows":22,"n_cols":3,"rows_kept":22,"cut":false,"hidden":false,"merged":[]}
[]
["Steps to Simulate Regulation Market Clearing with MRTS Framework"]
["1. Start on the MRTS Clearing TPSSOLVE sheet"]
["2. Update any of the inputs listed below: 2a through 2e"]
[null,"a. Only make updates to the cells with light blue background on the \"MRTS Clearing TPSSOLVE\" sheet"]
[null,"b. RegA - Resource Name, RawMW, $ Price Offer, $ Cost Offer, Self Scheduled, Perf Score, Owner"]
[null,null,"i. $ Price Offer represents Price-Based Capability Offer + Price-Based Performance Offer"]
[null,null,"ii. $ Cost Offer represents Cost-Based Capability Offer + Cost-Based Performance Offer"]
[null,null,"iii. $ Price Offer and $ Cost Offer are ignored, and Adj Cost Offer are set to $0 when the Self-Schedule flag is set to 1"]
[null,"c. RegD - Resource Name, RawMW, $ Price Offer, $ Cost Offer, Self Scheduled, Perf Score, Owner"]
[null,null,"i. $ Price Offer represents Price-Based Capability Offer + Price-Based Performance Offer"]
[null,null,"ii. $ Cost Offer represents Cost-Based Capability Offer + Cost-Based Performance Offer"]
[null,null,"iii. $ Price Offer and $ Cost Offer are ignored, and Adj Cost Offer are set to $0 when the Self-Schedule flag is set to 1"]
[null,"d. Chosen Period - Select Season and either Ramping or Non-Ramping from the dropdown box"]
[null,null,"i. RTS Equations - equations from the results of the Regulation Study are listed as examples"]
{"$rows_left_out":8}
{"sheet":"MRTS Clearing TPSSOLVE","index":1,"n_rows":65,"n_cols":34,"rows_kept":65,"cut":false,"hidden":false,"merged":[[0,15,28,15],[41,10,41,11],[44,10,44,11],[0,0,28,0],[30,0,57,0],[41,15,57,15],[30,10,30,11],[30,15,38,15],[42,10,42,11],[45,10,45,11],[41,32,41,33],[50,32,50,33],[50,29,50,30],[41,29,41,30],[41,26,41,27],[50,26,50,27],[56,16,56,17],[50,23,50,24],[41,23,41,24],[59,24,59,27],[49,16,49,17],[51,16,51,17],[53,16,53,17],[55,16,55,17],[50,16,50,17],[52,16,52,17],[54,16,54,17]]}
["Regulation Resource Offers","RegA Resources","RawMW","$ Price Offer","$ Cost Offer","Self Schedule","Perf Score","Owner","Adj Cost Offer (Assume LOC Included)","Cost per Effective RegA","Perf Adj MW","Cum Perf Adj MW","Cum Eff MW","Indiv Eff MW","RTS","Regulation Resource Clearing","Status","Cleared Perf Adj MW","Cleared Eff MW for Isoquant","Cleared Eff MW","$ Per Eff RegA","Settlement Credit","TPS Eligibility","TPS Failed","PostTPS Adj Offer"]
[null,"A13",100,0,0,0,0.85,"Bravo",{"$f":"IF(F2=0,(MIN(D2,E2))/G2,0)","v":0},{"$f":"IF(O2<0,\"\",I2/O2)","v":0},{"$f":"C2*G2","v":85},{"$f":"SUM($K$2)","v":85},{"$f":"SUM(K2)","v":85},{"$f":"M2","v":85},1,null,{"$f":"INDEX($H$32:$H$58,MATCH(B2,$B$32:$B$58,0))","v":"Cleared"},{"$f":"IF($Q2=\"Cleared\",K2,IF($Q2=\"Partially Cleared\",K2-(INDEX($G$32:$G$58,MATCH(\"Partially Cleared\",$H$32:$H$58,0))-$K$43),\"\"))","v":85},{"$f":"R2","v":85},{"$f":"IF($R2=\"\",\"\",$R2)","v":85},{"$f":"IF(T2=\"\",\"\",$L$38)","v":3.333333333333333},{"$f":"IFERROR(T2*U2,0)","v":283.33333333333331},{"$f":"IF(J2<=(1.5*$L$38),1,0)","v":1},{"$f":"VLOOKUP($H2,$Q$32:$T$39,3,0)","v":0},{"$f":"IF(F2=0,IF(W2=0,999,IF(AND(W2=1,X2=0),D2/G2,I2)),0)","v":0}]
[null,"A2",100,0,0,0,0.5,"Echo",{"$f":"IF(F3=0,(MIN(D3,E3))/G3,0)","v":0},0,50,{"$f":"SUM($K$2:$K$3)","v":135},{"$f":"SUM($K$2:K3)","v":135},{"$f":"M3-M2","v":50},1,null,"Cleared",50,{"$f":"R3","v":50},{"$f":"IF($R3=\"\",\"\",$R3)","v":50},3.333333333333333,{"$f":"IFERROR(T3*U3,0)","v":166.66666666666666},1,0,{"$f":"IF(F3=0,IF(W3=0,999,IF(AND(W3=1,X3=0),D3/G3,I3)),0)","v":0}]
[null,"A3",100,2,1,0,0.75,"Alpha",{"$f":"IF(F4=0,(MIN(D4,E4))/G4,0)","v":1.3333333333333333},1.3333333333333333,75,{"$f":"SUM($K$2:$K$4)","v":210},{"$f":"SUM($K$2:K4)","v":210},{"$f":"M4-M3","v":75},1,null,"Cleared",75,75,75,3.333333333333333,249.99999999999997,1,0,2.6666666666666665]
[null,"A4",100,3,2,0,0.9,"Charlie",{"$f":"IF(F5=0,(MIN(D5,E5))/G5,0)","v":2.2222222222222223},2.2222222222222223,90,{"$f":"SUM($K$2:$K$5)","v":300},{"$f":"SUM($K$2:K5)","v":300},90,1,null,"Cleared",90,90,90,3.333333333333333,300,1,0,3.333333333333333]
[null,"A1",100,3,3,0,0.9,"Gamma",{"$f":"IF(F6=0,(MIN(D6,E6))/G6,0)","v":3.333333333333333},3.333333333333333,90,{"$f":"SUM($K$2:$K$6)","v":390},{"$f":"SUM($K$2:K6)","v":390},90,1,null,"Partially Cleared",58.153418750000014,58.153418750000014,58.153418750000014,3.333333333333333,193.8447291666667,1,0,3.333333333333333]
[null,"A14",100,6,3,0,0.78,"Harry",{"$f":"IF(F7=0,(MIN(D7,E7))/G7,0)","v":3.8461538461538458},3.8461538461538458,78,{"$f":"SUM($K$2:$K$7)","v":468},{"$f":"SUM($K$2:K7)","v":468},78,1,null,"Not Cleared","","","","",0,1,0,7.6923076923076916]
[null,"A5",100,4,3,0,0.72,"Delta",{"$f":"IF(F8=0,(MIN(D8,E8))/G8,0)","v":4.166666666666667},4.166666666666667,72,{"$f":"SUM($K$2:$K$8)","v":540},{"$f":"SUM($K$2:K8)","v":540},72,1,null,"Not Cleared","","","","",0,1,0,5.5555555555555554]
[null,"A6",100,5,4,0,0.78,"Bravo",{"$f":"IF(F9=0,(MIN(D9,E9))/G9,0)","v":5.1282051282051277},5.1282051282051277,78,{"$f":"SUM($K$2:$K$9)","v":618},{"$f":"SUM($K$2:K9)","v":618},78,1,null,"Not Cleared","","","","",0,0,0,999]
[null,"A15",100,5,4,0,0.72,"Delta",{"$f":"IF(F10=0,(MIN(D10,E10))/G10,0)","v":5.5555555555555554},5.5555555555555554,72,{"$f":"SUM($K$2:$K$10)","v":690},{"$f":"SUM($K$2:K10)","v":690},72,1,null,"Not Cleared","","","","",0,0,0,999]
[null,"A11",100,10,5,0,0.85,"Gamma",{"$f":"IF(F11=0,(MIN(D11,E11))/G11,0)","v":5.882352941176471},5.882352941176471,85,{"$f":"SUM($K$2:$K$11)","v":775},{"$f":"SUM($K$2:K11)","v":775},85,1,null,"Not Cleared","","","","",0,0,0,999]
[null,"A7",100,6,5,0,0.8,"Alpha",{"$f":"IF(F12=0,(MIN(D12,E12))/G12,0)","v":6.25},6.25,80,{"$f":"SUM($K$2:$K$12)","v":855},{"$f":"SUM($K$2:K12)","v":855},80,1,null,"Not Cleared","","","","",0,0,0,999]
[null,"A12",100,10,5,0,0.75,"Echo",{"$f":"IF(F13=0,(MIN(D13,E13))/G13,0)","v":6.666666666666667},6.666666666666667,75,{"$f":"SUM($K$2:$K$13)","v":930},{"$f":"SUM($K$2:K13)","v":930},75,1,null,"Not Cleared","","","","",0,0,0,999]
[null,"A9",100,8,6,0,0.88,"Foxtrot",{"$f":"IF(F14=0,(MIN(D14,E14))/G14,0)","v":6.8181818181818183},6.8181818181818183,88,{"$f":"SUM($K$2:$K$14)","v":1018},{"$f":"SUM($K$2:K14)","v":1018},88,1,null,"Not Cleared","","","","",0,0,0,999]
[null,"A8",100,7,5,0,0.7,"Echo",{"$f":"IF(F15=0,(MIN(D15,E15))/G15,0)","v":7.1428571428571432},7.1428571428571432,70,{"$f":"SUM($K$2:$K$15)","v":1088},{"$f":"SUM($K$2:K15)","v":1088},70,1,null,"Not Cleared","","","","",0,0,0,999]
{"$rows_left_out":51}
{"sheet":"MRTS Clearing FINALSOLVE","index":2,"n_rows":58,"n_cols":22,"rows_kept":58,"cut":false,"hidden":false,"merged":[[0,15,28,15],[30,0,57,0],[0,0,28,0],[30,10,30,11]]}
["Regulation Resource Offers","RegA Resources","RawMW","$ Price Offer","$ Cost Offer","Self Schedule","Perf Score","Owner","PostTPS Adj Offer (Assume LOC Included)","Cost per Effective RegA","Perf Adj MW","Cum Perf Adj MW","Cum Eff MW","Indiv Eff MW","RTS","Regulation Resource Clearing","Status","Cleared Perf Adj MW","Cleared Eff MW for Isoquant","Cleared Eff MW","$ Per Eff RegA","Settlement Credit"]
[null,"A13",100,0,0,0,0.85,"Bravo",{"$f":"VLOOKUP($B2,'MRTS Clearing TPSSOLVE'!$B$2:$Y$16,24,0)","v":0},{"$f":"IF(O2<0,\"\",I2/O2)","v":0},{"$f":"C2*G2","v":85},{"$f":"SUM($K$2)","v":85},{"$f":"SUM(K2)","v":85},{"$f":"M2","v":85},1,null,{"$f":"INDEX($H$32:$H$58,MATCH(B2,$B$32:$B$58,0))","v":"Cleared"},{"$f":"IF($Q2=\"Cleared\",K2,IF($Q2=\"Partially Cleared\",K2-(INDEX($G$32:$G$58,MATCH(\"Partially Cleared\",$H$32:$H$58,0))-'MRTS Clearing TPSSOLVE'!$K$43),\"\"))","v":85},{"$f":"R2","v":85},{"$f":"IF($R2=\"\",\"\",$R2)","v":85},{"$f":"IF(T2=\"\",\"\",$L$38)","v":3.333333333333333},{"$f":"IFERROR(T2*U2,0)","v":283.33333333333331}]
[null,"A2",100,0,0,0,0.5,"Echo",{"$f":"VLOOKUP($B3,'MRTS Clearing TPSSOLVE'!$B$2:$Y$16,24,0)","v":0},0,50,{"$f":"SUM($K$2:$K$3)","v":135},{"$f":"SUM($K$2:K3)","v":135},{"$f":"M3-M2","v":50},1,null,"Cleared",{"$f":"IF($Q3=\"Cleared\",K3,IF($Q3=\"Partially Cleared\",K3-(INDEX($G$32:$G$58,MATCH(\"Partially Cleared\",$H$32:$H$58,0))-'MRTS Clearing TPSSOLVE'!$K$43),\"\"))","v":50},{"$f":"R3","v":50},{"$f":"IF($R3=\"\",\"\",$R3)","v":50},3.333333333333333,{"$f":"IFERROR(T3*U3,0)","v":166.66666666666666}]
[null,"A3",100,2,1,0,0.75,"Alpha",{"$f":"VLOOKUP($B4,'MRTS Clearing TPSSOLVE'!$B$2:$Y$16,24,0)","v":2.6666666666666665},2.6666666666666665,75,{"$f":"SUM($K$2:$K$4)","v":210},{"$f":"SUM($K$2:K4)","v":210},{"$f":"M4-M3","v":75},1,null,"Cleared",{"$f":"IF($Q4=\"Cleared\",K4,IF($Q4=\"Partially Cleared\",K4-(INDEX($G$32:$G$58,MATCH(\"Partially Cleared\",$H$32:$H$58,0))-'MRTS Clearing TPSSOLVE'!$K$43),\"\"))","v":75},75,75,3.333333333333333,249.99999999999997]
[null,"A4",100,3,2,0,0.9,"Charlie",{"$f":"VLOOKUP($B5,'MRTS Clearing TPSSOLVE'!$B$2:$Y$16,24,0)","v":3.333333333333333},3.333333333333333,90,{"$f":"SUM($K$2:$K$5)","v":300},{"$f":"SUM($K$2:K5)","v":300},90,1,null,"Cleared",{"$f":"IF($Q5=\"Cleared\",K5,IF($Q5=\"Partially Cleared\",K5-(INDEX($G$32:$G$58,MATCH(\"Partially Cleared\",$H$32:$H$58,0))-'MRTS Clearing TPSSOLVE'!$K$43),\"\"))","v":90},90,90,3.333333333333333,300]
[null,"A1",100,3,3,0,0.9,"Gamma",{"$f":"VLOOKUP($B6,'MRTS Clearing TPSSOLVE'!$B$2:$Y$16,24,0)","v":3.333333333333333},3.333333333333333,90,{"$f":"SUM($K$2:$K$6)","v":390},{"$f":"SUM($K$2:K6)","v":390},90,1,null,"Partially Cleared",{"$f":"IF($Q6=\"Cleared\",K6,IF($Q6=\"Partially Cleared\",K6-(INDEX($G$32:$G$58,MATCH(\"Partially Cleared\",$H$32:$H$58,0))-'MRTS Clearing TPSSOLVE'!$K$43),\"\"))","v":86.59266875000003},86.59266875000003,86.59266875000003,3.333333333333333,288.64222916666677]
[null,"A5",100,4,3,0,0.72,"Delta",{"$f":"VLOOKUP($B7,'MRTS Clearing TPSSOLVE'!$B$2:$Y$16,24,0)","v":5.5555555555555554},5.5555555555555554,72,{"$f":"SUM($K$2:$K$7)","v":462},{"$f":"SUM($K$2:K7)","v":462},72,1,null,"Not Cleared",{"$f":"IF($Q7=\"Cleared\",K7,IF($Q7=\"Partially Cleared\",K7-(INDEX($G$32:$G$58,MATCH(\"Partially Cleared\",$H$32:$H$58,0))-'MRTS Clearing TPSSOLVE'!$K$43),\"\"))","v":""},"","","",0]
[null,"A14",100,6,3,0,0.78,"Harry",{"$f":"VLOOKUP($B8,'MRTS Clearing TPSSOLVE'!$B$2:$Y$16,24,0)","v":7.6923076923076916},7.6923076923076916,78,{"$f":"SUM($K$2:$K$8)","v":540},{"$f":"SUM($K$2:K8)","v":540},78,1,null,"Not Cleared",{"$f":"IF($Q8=\"Cleared\",K8,IF($Q8=\"Partially Cleared\",K8-(INDEX($G$32:$G$58,MATCH(\"Partially Cleared\",$H$32:$H$58,0))-'MRTS Clearing TPSSOLVE'!$K$43),\"\"))","v":""},"","","",0]
[null,"A9",100,8,6,0,0.88,"Foxtrot",{"$f":"VLOOKUP($B9,'MRTS Clearing TPSSOLVE'!$B$2:$Y$16,24,0)","v":999},999,88,{"$f":"SUM($K$2:$K$9)","v":628},{"$f":"SUM($K$2:K9)","v":628},88,1,null,"Not Cleared",{"$f":"IF($Q9=\"Cleared\",K9,IF($Q9=\"Partially Cleared\",K9-(INDEX($G$32:$G$58,MATCH(\"Partially Cleared\",$H$32:$H$58,0))-'MRTS Clearing TPSSOLVE'!$K$43),\"\"))","v":""},"","","",0]
[null,"A11",100,10,5,0,0.85,"Gamma",{"$f":"VLOOKUP($B10,'MRTS Clearing TPSSOLVE'!$B$2:$Y$16,24,0)","v":999},999,85,{"$f":"SUM($K$2:$K$10)","v":713},{"$f":"SUM($K$2:K10)","v":713},85,1,null,"Not Cleared",{"$f":"IF($Q10=\"Cleared\",K10,IF($Q10=\"Partially Cleared\",K10-(INDEX($G$32:$G$58,MATCH(\"Partially Cleared\",$H$32:$H$58,0))-'MRTS Clearing TPSSOLVE'!$K$43),\"\"))","v":""},"","","",0]
[null,"A7",100,6,5,0,0.8,"Alpha",{"$f":"VLOOKUP($B11,'MRTS Clearing TPSSOLVE'!$B$2:$Y$16,24,0)","v":999},999,80,{"$f":"SUM($K$2:$K$11)","v":793},{"$f":"SUM($K$2:K11)","v":793},80,1,null,"Not Cleared",{"$f":"IF($Q11=\"Cleared\",K11,IF($Q11=\"Partially Cleared\",K11-(INDEX($G$32:$G$58,MATCH(\"Partially Cleared\",$H$32:$H$58,0))-'MRTS Clearing TPSSOLVE'!$K$43),\"\"))","v":""},"","","",0]
[null,"A6",100,5,4,0,0.78,"Bravo",{"$f":"VLOOKUP($B12,'MRTS Clearing TPSSOLVE'!$B$2:$Y$16,24,0)","v":999},999,78,{"$f":"SUM($K$2:$K$12)","v":871},{"$f":"SUM($K$2:K12)","v":871},78,1,null,"Not Cleared",{"$f":"IF($Q12=\"Cleared\",K12,IF($Q12=\"Partially Cleared\",K12-(INDEX($G$32:$G$58,MATCH(\"Partially Cleared\",$H$32:$H$58,0))-'MRTS Clearing TPSSOLVE'!$K$43),\"\"))","v":""},"","","",0]
[null,"A10",100,9,8,0,0.78,"Charlie",{"$f":"VLOOKUP($B13,'MRTS Clearing TPSSOLVE'!$B$2:$Y$16,24,0)","v":999},999,78,{"$f":"SUM($K$2:$K$13)","v":949},{"$f":"SUM($K$2:K13)","v":949},78,1,null,"Not Cleared",{"$f":"IF($Q13=\"Cleared\",K13,IF($Q13=\"Partially Cleared\",K13-(INDEX($G$32:$G$58,MATCH(\"Partially Cleared\",$H$32:$H$58,0))-'MRTS Clearing TPSSOLVE'!$K$43),\"\"))","v":""},"","","",0]
[null,"A12",100,10,5,0,0.75,"Echo",{"$f":"VLOOKUP($B14,'MRTS Clearing TPSSOLVE'!$B$2:$Y$16,24,0)","v":999},999,75,{"$f":"SUM($K$2:$K$14)","v":1024},{"$f":"SUM($K$2:K14)","v":1024},75,1,null,"Not Cleared",{"$f":"IF($Q14=\"Cleared\",K14,IF($Q14=\"Partially Cleared\",K14-(INDEX($G$32:$G$58,MATCH(\"Partially Cleared\",$H$32:$H$58,0))-'MRTS Clearing TPSSOLVE'!$K$43),\"\"))","v":""},"","","",0]
[null,"A15",100,5,4,0,0.72,"Delta",{"$f":"VLOOKUP($B15,'MRTS Clearing TPSSOLVE'!$B$2:$Y$16,24,0)","v":999},999,72,{"$f":"SUM($K$2:$K$15)","v":1096},{"$f":"SUM($K$2:K15)","v":1096},72,1,null,"Not Cleared",{"$f":"IF($Q15=\"Cleared\",K15,IF($Q15=\"Partially Cleared\",K15-(INDEX($G$32:$G$58,MATCH(\"Partially Cleared\",$H$32:$H$58,0))-'MRTS Clearing TPSSOLVE'!$K$43),\"\"))","v":""},"","","",0]
{"$rows_left_out":44}
{"sheet":"Framework (Current vs MRTS)","index":3,"n_rows":25,"n_cols":8,"rows_kept":25,"cut":false,"hidden":false,"merged":[[23,0,24,0],[23,1,24,2],[23,4,23,5],[23,6,24,7],[24,4,24,5],[21,0,22,0],[21,1,22,2],[21,4,21,5],[21,6,21,7],[22,4,22,5],[22,6,22,7],[18,4,18,5],[18,6,18,7],[19,1,19,3],[19,4,19,5],[19,6,19,7],[20,1,20,3],[20,4,20,5],[20,6,20,7],[15,6,15,7],[16,0,18,0],[16,1,18,1],[16,2,16,3],[16,4,16,5],[16,6,16,7],[17,2,17,3],[17,4,17,5],[17,6,17,7],[18,2,18,3],[13,0,15,0],[13,1,15,1],[13,2,13,3],[15,2,15,3],[15,4,15,5],[11,1,11,3],[11,4,11,5],[11,6,11,7],[12,1,12,3],[12,4,12,5],[12,6,12,7],[13,4,13,5],[13,6,13,7],[14,2,14,3],[14,4,14,5],[14,6,14,7],[8,1,8,3],[8,4,8,5],[8,6,8,7],[9,0,10,0],[9,1,10,2],[9,4,9,5],[9,6,9,7],[10,4,10,5],[10,6,10,7],[6,1,6,3],[6,4,6,5],[6,6,6,7],[7,1,7,3],[7,4,7,5],[7,6,7,7],[0,4,0,5],[0,6,0,7],[2,0,5,0],[2,1,5,1],[2,2,3,2],[4,2,5,2]]}
[null,null,null,null,"Current",null,"MRTS Framework"]
[null,null,null,null,"Conventional Generator","Energy Storage Device","Conventional Generator","Energy Storage Device"]
[1,"Regulation Price Offers","Cost-Based Regulation Offer","Capability Cost-Based Offer","[(Difference in Reduced Load and Base Load Heat Rate Fuel Input * Fuel Cost)/(Eco Max - Reg Min)] + Regulation Margin Adder ","Regulation Margin Risk Adder\nHeat Rate Adjustment (Operating Range) for Battery and Flywheel Units is zero.","[(Difference in Reduced Load and Base Load Heat Rate Fuel Input * Fuel Cost)/(Eco Max - Reg Min)] + Regulation Margin Adder ","Regulation Margin Risk Adder\nHeat Rate Adjustment (Operating Range) for Battery and Flywheel Units is zero."]
[null,null,null,"Performance Cost-Based Offer","{[(Heat Rate Loss* Fuel Cost)/Reg Band MW] + VOM}/Historic Mileage ","(VOM + Energy Storage Unit Losses) / Historic Mileage\nHeat Rate Adjustment (Non Steady-State Operation) for Battery and Flywheel Units is zero.","{[(Heat Rate Loss* Fuel Cost)/Reg Band MW] + VOM}/Historic Mileage ","(VOM + Energy Storage Unit Losses) / Historic Mileage\nHeat Rate Adjustment (Non Steady-State Operation) for Battery and Flywheel Units is zero."]
[null,null,"Price-Based Regulation Offer","Capability Price-Based Offer","Optional but <= $100 when sum with cost-based offer","Optional but <= $100 when sum with cost-based offer","Optional but <= $100 when sum with cost-based offer","Optional but <= $100 when sum with cost-based offer"]
[null,null,null,"Performance Price-Based Offer","Optional but adjusted by Historic Mileage ","Optional but adjusted by Historic Mileage ","Optional but adjusted by Historic Mileage ","Optional but adjusted by Historic Mileage "]
[2,"Regulation Offer MW",null,null,"Same",null,"Same"]
[3,"Performance Score",null,null,"Same",null,"Same"]
[4,"Mileage",null,null,"Same",null,"Same"]
[5,"Rate of Substitution between Signals",null,"RegA",1,null,1]
[null,null,null,"RegD","Benefits factor (BF)",null,"Rate of Technical Substitution (RTS)"]
[6,"Performance Adjusted MW",null,null,"Reg MW * Performance Score, That is MW * PS",null,"Reg MW * Performance Score, That is MW * PS"]
[7,"Effective MW",null,null,"MW * PS * BF",null,"(MW * PS * RTS) + ∆ (Area under the curve)"]
[8,"Initial Adjusted Cost","Adjusted Capability Cost",null,"Cap$ / (PS)",null,"Cap$ / (PS)"]
[null,null,"Adjusted Performance Cost",null,"(Per$ * Mileage) / (PS)",null,"(Per$ * Mileage) / (PS)"]
{"$rows_left_out":10}