{"text_format":"1","workbook":"xlsx","n_sheets":6,"sheets":["Instructions","Model -->","Auction Simulation","Data -->","Demand Curve Parameters","LOLE Data"],"not_rendered":{"charts":1,"images":0,"macros":1,"external_links":0,"defined_names":41,"comments":0,"pivot_tables":0},"unopened":[],"bounds":{"document_bytes":16777216,"sheet_cells":100000,"rows_first":2000,"rows_last":500,"rows_between":2000,"halvings":0,"cell_chars":16384,"cell_head_chars":4096},"cells_cut":0,"cells_raw":0,"read":"whole","date_system":"1900"}

{"sheet":"Instructions","index":0,"n_rows":35,"n_cols":4,"rows_kept":35,"cut":false,"hidden":false,"merged":[]}
[]
[]
[]
[null,"Description:"]
[]
[null,"This workbook contains a simplified version of The Brattle Group's proprietary simulation model used to test demand curve performance in PJM.  All cells highlighted in green are user inputs; all cells highlighted in orange are user outputs.  Please see the instructions below on how to run the simplified model and how to create a user-defined demand curve."]
[]
[null,"Instructions:"]
[]
[null,"Only adjust the input cells, highlighted in green, otherwise the model could break."]
[]
[null,"How To Run a Simulation:",null,"Cell Color Coding:"]
[null,"1)  Go to the [Auction Simulation] tab",null,"user input"]
[null,"2)  Select the appropriate demand curve from the pre-populated list in cell B4",null,"user input error"]
[null,"    Note: Use the scroll bar in the Demand Curve list to view all available selections",null,"user output"]
[null,"3)  Adjust the total offer quantity in cell  D4"]
[null,"4)  Click the \"Calculate Clearing Price\" button to run the auction"]
[]
[null,"How To Create a User-Defined Demand Curve:"]
[null,"1)  Go to the [Demand Curve Parameters] tab"]
{"$rows_left_out":16}
{"sheet":"Model -->","index":1,"n_rows":0,"n_cols":0,"rows_kept":0,"cut":false,"hidden":true,"merged":[]}

{"sheet":"Auction Simulation","index":2,"n_rows":81,"n_cols":24,"rows_kept":81,"cut":false,"hidden":false,"merged":[[3,1,3,2]]}
[]
[null,"Inputs",null,null,null,null,null,"Output",null,null,null,null,null,null,null,null,null,null,null,"Clearing Automation",null,null,null,"Demand Curve Options"]
[null,"Demand Curve Selection\n(Drop-down Below)",null,"Total Offer Quantity\n(MW must be > 150,000)",null,null,null,"Auction Clearing Results",null,null,null,"Input Demand Curve Definition",null,null,null,"Corresponding Demand Curve Parameters",null,null,null,"Initial Quantity",{"$f":"D4-$M$62","v":113841.43355955728},160101.43355955728]
[null,"Current VRR Curve",null,160000,null,null,null,null,"Current Run","Previous Run",null,null,"Quantity (UCAP RM %)","Price (% of Net Cone)",null,"MW","LOLE"," ($/MW-d)",null,"SC Price",{"$f":"Interpolate($P$19:$P$69,$N$19:$N$69,$V$3)","v":700.44380000000001},null,null,"User-Defined Curve"]
[null,null,null,null,null,null,null,"Price ($/MW-d)",495.8,495.8,null,"Point 1",{"$f":"IFERROR(ROUND(INDEX('Demand Curve Parameters'!$H$4:$K$49,MATCH(VALUE(MID($L5,FIND(\" \",$L5)+1,10)),'Demand Curve Parameters'!$H$4:$H$49,0),MATCH(M$4,'Demand Curve Parameters'!$H$4:$K$4,0)),5),\"\")","v":0},{"$f":"IFERROR(ROUND(INDEX('Demand Curve Parameters'!$H$4:$K$49,MATCH(VALUE(MID($L5,FIND(\" \",$L5)+1,10)),'Demand Curve Parameters'!$H$4:$H$49,0),MATCH(N$4,'Demand Curve Parameters'!$H$4:$K$4,0)),5),\"\")","v":1.5},null,{"$f":"IF(ISNUMBER(M5),0,\"\")","v":0},{"$f":"IFERROR(IF(Interpolate('LOLE Data'!$H$6:$H$32,'LOLE Data'!$B$6:$B$32,$P5)=\"X is Too Low\",\"> 0.2\",Interpolate('LOLE Data'!$H$6:$H$32,'LOLE Data'!$B$6:$B$32,$P5)),\"\")","v":0},{"$f":"IFERROR($N5*$B$42,\"\")","v":495.79499999999996},null,"DC Price",{"$f":"Interpolate($P$5:$P$14,$R$5:$R$14,$V$3)","v":495.79500000000002},null,null,"Current VRR Curve"]
[null,null,null,null,null,null,null,"LOLE",{"$f":"IF(Interpolate('LOLE Data'!$H$6:$H$21,'LOLE Data'!$B$6:$B$21,I$9)=\"X is Too Low\",\"Below 1-in-5\",\"1-in-\"&ROUND(1/Interpolate('LOLE Data'!$H$6:$H$21,'LOLE Data'!$B$6:$B$21,I$9),1))","v":"Below 1-in-5"},{"$f":"IF(Interpolate('LOLE Data'!$H$6:$H$21,'LOLE Data'!$B$6:$B$21,J$9)=\"X is Too Low\",\"Below 1-in-5\",\"1-in-\"&ROUND(1/Interpolate('LOLE Data'!$H$6:$H$21,'LOLE Data'!$B$6:$B$21,J$9),1))","v":"Below 1-in-5"},null,"Point 2",{"$f":"IFERROR(ROUND(INDEX('Demand Curve Parameters'!$H$4:$K$49,MATCH(VALUE(MID($L6,FIND(\" \",$L6)+1,10)),'Demand Curve Parameters'!$H$4:$H$49,0),MATCH(M$4,'Demand Curve Parameters'!$H$4:$K$4,0)),5),M5)","v":6.191E-2},{"$f":"IFERROR(ROUND(INDEX('Demand Curve Parameters'!$H$4:$K$49,MATCH(VALUE(MID($L6,FIND(\" \",$L6)+1,10)),'Demand Curve Parameters'!$H$4:$H$49,0),MATCH(N$4,'Demand Curve Parameters'!$H$4:$K$4,0)),5),N5)","v":1.5},null,{"$f":"IFERROR((M6+1)*'Auction Simulation'!$B$41,\"\")","v":161816.60676599998},{"$f":"IFERROR(IF(Interpolate('LOLE Data'!$H$6:$H$32,'LOLE Data'!$B$6:$B$32,$P6)=\"X is Too Low\",\"> 0.2\",Interpolate('LOLE Data'!$H$6:$H$32,'LOLE Data'!$B$6:$B$32,$P6)),\"\")","v":9.4174016546746259E-3},{"$f":"IFERROR($N6*$B$42,\"\")","v":495.79499999999996},null,"Check",{"$f":"U5-U4","v":-204.64879999999999},null,null,"Brattle Proposed"]
[null,null,null,null,null,null,null,null,null,null,null,"Point 3",{"$f":"IFERROR(ROUND(INDEX('Demand Curve Parameters'!$H$4:$K$49,MATCH(VALUE(MID($L7,FIND(\" \",$L7)+1,10)),'Demand Curve Parameters'!$H$4:$H$49,0),MATCH(M$4,'Demand Curve Parameters'!$H$4:$K$4,0)),5),M6)","v":9.9629999999999996E-2},{"$f":"IFERROR(ROUND(INDEX('Demand Curve Parameters'!$H$4:$K$49,MATCH(VALUE(MID($L7,FIND(\" \",$L7)+1,10)),'Demand Curve Parameters'!$H$4:$H$49,0),MATCH(N$4,'Demand Curve Parameters'!$H$4:$K$4,0)),5),N6)","v":1},null,{"$f":"IFERROR((M7+1)*'Auction Simulation'!$B$41,\"\")","v":167564.47843799999},{"$f":"IFERROR(IF(Interpolate('LOLE Data'!$H$6:$H$32,'LOLE Data'!$B$6:$B$32,$P7)=\"X is Too Low\",\"> 0.2\",Interpolate('LOLE Data'!$H$6:$H$32,'LOLE Data'!$B$6:$B$32,$P7)),\"\")","v":"X is Too High"},330.53,null,null,null,null,null,"PJM Proposed"]
[null,null,null,null,null,null,null,"Demand Curve","Current VRR Curve","Current VRR Curve",null,"Point 4",{"$f":"IFERROR(ROUND(INDEX('Demand Curve Parameters'!$H$4:$K$49,MATCH(VALUE(MID($L8,FIND(\" \",$L8)+1,10)),'Demand Curve Parameters'!$H$4:$H$49,0),MATCH(M$4,'Demand Curve Parameters'!$H$4:$K$4,0)),5),M7)","v":0.13735},{"$f":"IFERROR(ROUND(INDEX('Demand Curve Parameters'!$H$4:$K$49,MATCH(VALUE(MID($L8,FIND(\" \",$L8)+1,10)),'Demand Curve Parameters'!$H$4:$H$49,0),MATCH(N$4,'Demand Curve Parameters'!$H$4:$K$4,0)),5),N7)","v":0.2},null,{"$f":"IFERROR((M8+1)*'Auction Simulation'!$B$41,\"\")","v":173312.35011000003},{"$f":"IFERROR(IF(Interpolate('LOLE Data'!$H$6:$H$32,'LOLE Data'!$B$6:$B$32,$P8)=\"X is Too Low\",\"> 0.2\",Interpolate('LOLE Data'!$H$6:$H$32,'LOLE Data'!$B$6:$B$32,$P8)),\"\")","v":"X is Too High"},66.105999999999995,null,null,null,null,null,"Vertical at RR"]
[null,null,null,null,null,null,null,"UCAP Quantity (MW)",160101.43355955728,160101.43355955728,null,"Point 5",{"$f":"IFERROR(ROUND(INDEX('Demand Curve Parameters'!$H$4:$K$49,MATCH(VALUE(MID($L9,FIND(\" \",$L9)+1,10)),'Demand Curve Parameters'!$H$4:$H$49,0),MATCH(M$4,'Demand Curve Parameters'!$H$4:$K$4,0)),5),M8)","v":0.13735},{"$f":"IFERROR(ROUND(INDEX('Demand Curve Parameters'!$H$4:$K$49,MATCH(VALUE(MID($L9,FIND(\" \",$L9)+1,10)),'Demand Curve Parameters'!$H$4:$H$49,0),MATCH(N$4,'Demand Curve Parameters'!$H$4:$K$4,0)),5),N8)","v":0},null,{"$f":"IFERROR((M9+1)*'Auction Simulation'!$B$41,\"\")","v":173312.35011000003},{"$f":"IFERROR(IF(Interpolate('LOLE Data'!$H$6:$H$32,'LOLE Data'!$B$6:$B$32,$P9)=\"X is Too Low\",\"> 0.2\",Interpolate('LOLE Data'!$H$6:$H$32,'LOLE Data'!$B$6:$B$32,$P9)),\"\")","v":"X is Too High"},0,null,null,null,null,null,"ISO-NE"]
[null,null,null,null,null,null,null,null,null,null,null,"Point 6",{"$f":"IFERROR(ROUND(INDEX('Demand Curve Parameters'!$H$4:$K$49,MATCH(VALUE(MID($L10,FIND(\" \",$L10)+1,10)),'Demand Curve Parameters'!$H$4:$H$49,0),MATCH(M$4,'Demand Curve Parameters'!$H$4:$K$4,0)),5),M9)","v":0.13735},{"$f":"IFERROR(ROUND(INDEX('Demand Curve Parameters'!$H$4:$K$49,MATCH(VALUE(MID($L10,FIND(\" \",$L10)+1,10)),'Demand Curve Parameters'!$H$4:$H$49,0),MATCH(N$4,'Demand Curve Parameters'!$H$4:$K$4,0)),5),N9)","v":0},null,{"$f":"IFERROR((M10+1)*'Auction Simulation'!$B$41,\"\")","v":173312.35011000003},{"$f":"IFERROR(IF(Interpolate('LOLE Data'!$H$6:$H$32,'LOLE Data'!$B$6:$B$32,$P10)=\"X is Too Low\",\"> 0.2\",Interpolate('LOLE Data'!$H$6:$H$32,'LOLE Data'!$B$6:$B$32,$P10)),\"\")","v":"X is Too High"},0,null,null,null,null,null,"NYISO"]
[null,null,null,null,null,null,null,null,null,null,null,"Point 7",{"$f":"IFERROR(ROUND(INDEX('Demand Curve Parameters'!$H$4:$K$49,MATCH(VALUE(MID($L11,FIND(\" \",$L11)+1,10)),'Demand Curve Parameters'!$H$4:$H$49,0),MATCH(M$4,'Demand Curve Parameters'!$H$4:$K$4,0)),5),M10)","v":0.13735},{"$f":"IFERROR(ROUND(INDEX('Demand Curve Parameters'!$H$4:$K$49,MATCH(VALUE(MID($L11,FIND(\" \",$L11)+1,10)),'Demand Curve Parameters'!$H$4:$H$49,0),MATCH(N$4,'Demand Curve Parameters'!$H$4:$K$4,0)),5),N10)","v":0},null,{"$f":"IFERROR((M11+1)*'Auction Simulation'!$B$41,\"\")","v":173312.35011000003},{"$f":"IFERROR(IF(Interpolate('LOLE Data'!$H$6:$H$32,'LOLE Data'!$B$6:$B$32,$P11)=\"X is Too Low\",\"> 0.2\",Interpolate('LOLE Data'!$H$6:$H$32,'LOLE Data'!$B$6:$B$32,$P11)),\"\")","v":"X is Too High"},0]
[null,null,null,null,null,null,null,null,null,null,null,"Point 8",{"$f":"IFERROR(ROUND(INDEX('Demand Curve Parameters'!$H$4:$K$49,MATCH(VALUE(MID($L12,FIND(\" \",$L12)+1,10)),'Demand Curve Parameters'!$H$4:$H$49,0),MATCH(M$4,'Demand Curve Parameters'!$H$4:$K$4,0)),5),M11)","v":0.13735},{"$f":"IFERROR(ROUND(INDEX('Demand Curve Parameters'!$H$4:$K$49,MATCH(VALUE(MID($L12,FIND(\" \",$L12)+1,10)),'Demand Curve Parameters'!$H$4:$H$49,0),MATCH(N$4,'Demand Curve Parameters'!$H$4:$K$4,0)),5),N11)","v":0},null,{"$f":"IFERROR((M12+1)*'Auction Simulation'!$B$41,\"\")","v":173312.35011000003},{"$f":"IFERROR(IF(Interpolate('LOLE Data'!$H$6:$H$32,'LOLE Data'!$B$6:$B$32,$P12)=\"X is Too Low\",\"> 0.2\",Interpolate('LOLE Data'!$H$6:$H$32,'LOLE Data'!$B$6:$B$32,$P12)),\"\")","v":"X is Too High"},0]
[null,null,null,null,null,null,null,null,null,null,null,"Point 9",{"$f":"IFERROR(ROUND(INDEX('Demand Curve Parameters'!$H$4:$K$49,MATCH(VALUE(MID($L13,FIND(\" \",$L13)+1,10)),'Demand Curve Parameters'!$H$4:$H$49,0),MATCH(M$4,'Demand Curve Parameters'!$H$4:$K$4,0)),5),M12)","v":0.13735},{"$f":"IFERROR(ROUND(INDEX('Demand Curve Parameters'!$H$4:$K$49,MATCH(VALUE(MID($L13,FIND(\" \",$L13)+1,10)),'Demand Curve Parameters'!$H$4:$H$49,0),MATCH(N$4,'Demand Curve Parameters'!$H$4:$K$4,0)),5),N12)","v":0},null,{"$f":"IFERROR((M13+1)*'Auction Simulation'!$B$41,\"\")","v":173312.35011000003},{"$f":"IFERROR(IF(Interpolate('LOLE Data'!$H$6:$H$32,'LOLE Data'!$B$6:$B$32,$P13)=\"X is Too Low\",\"> 0.2\",Interpolate('LOLE Data'!$H$6:$H$32,'LOLE Data'!$B$6:$B$32,$P13)),\"\")","v":"X is Too High"},0]
[null,null,null,null,null,null,null,null,null,null,null,"Point 10",{"$f":"IFERROR(ROUND(INDEX('Demand Curve Parameters'!$H$4:$K$49,MATCH(VALUE(MID($L14,FIND(\" \",$L14)+1,10)),'Demand Curve Parameters'!$H$4:$H$49,0),MATCH(M$4,'Demand Curve Parameters'!$H$4:$K$4,0)),5),M13)","v":0.13735},{"$f":"IFERROR(ROUND(INDEX('Demand Curve Parameters'!$H$4:$K$49,MATCH(VALUE(MID($L14,FIND(\" \",$L14)+1,10)),'Demand Curve Parameters'!$H$4:$H$49,0),MATCH(N$4,'Demand Curve Parameters'!$H$4:$K$4,0)),5),N13)","v":0},null,{"$f":"IFERROR((M14+1)*'Auction Simulation'!$B$41,\"\")","v":173312.35011000003},{"$f":"IFERROR(IF(Interpolate('LOLE Data'!$H$6:$H$32,'LOLE Data'!$B$6:$B$32,$P14)=\"X is Too Low\",\"> 0.2\",Interpolate('LOLE Data'!$H$6:$H$32,'LOLE Data'!$B$6:$B$32,$P14)),\"\")","v":"X is Too High"},0]
[]
[]
[null,null,null,null,null,null,null,null,null,null,null,"Supply Curve Core Shape",null,null,null,"Final Supply Curve"]
[null,null,null,null,null,null,null,null,null,null,null,"Block","Shape MW","Price",null,"MW"]
[null,null,null,null,null,null,null,null,null,null,null,1,0,0,null,0]
[null,null,null,null,null,null,null,null,null,null,null,2,1073.4550334986707,1.0194488888888891,null,{"$f":"$P$69-($M$69-$M20)","v":108473.15839206395}]
{"$rows_left_out":62}
{"sheet":"Data -->","index":3,"n_rows":0,"n_cols":0,"rows_kept":0,"cut":false,"hidden":true,"merged":[]}

{"sheet":"Demand Curve Parameters","index":4,"n_rows":56,"n_cols":11,"rows_kept":56,"cut":false,"hidden":false,"merged":[]}
[null,null,null,"Peak Load (MW):",null,null,null,{"$f":"COUNTIFS($A:$A,'Auction Simulation'!$B$4)","v":5},"# of DC Points"]
[]
[null,null,null,"User-Defined Curve",null,null,null,null,"Current Curve"]
[null,null,"Point","Quantity (UCAP RM %)","Quantity (% of RR)","Price (% of Net Cone)",null,"Point","Quantity (UCAP RM %)","Quantity (% of RR)","Price (% of Net Cone)"]
[{"$f":"IF(ISNUMBER(B5),D3,\"\")","v":"User-Defined Curve"},{"$f":"IF(ISNUMBER(E5),C5,\"\")","v":1},1,{"$f":"IF(E5=0,0,(E5*'Auction Simulation'!$B$40)/'Auction Simulation'!$B$41-1)","v":0},0,null,null,1,{"$f":"IF(ISNUMBER(H5),INDEX($A$3:$F$9996,MATCH('Auction Simulation'!$B$4&$H5,$A$3:$A$9996&$B$3:$B$9996,0),MATCH(I$4,$A$4:$F$4,0)),\"\")","v":0},{"$f":"IF(ISNUMBER(I5),INDEX($A$3:$F$9996,MATCH('Auction Simulation'!$B$4&$H5,$A$3:$A$9996&$B$3:$B$9996,0),MATCH(J$4,$A$4:$F$4,0)),\"\")","v":0},{"$f":"IF(ISNUMBER(J5),INDEX($A$3:$F$9996,MATCH('Auction Simulation'!$B$4&$H5,$A$3:$A$9996&$B$3:$B$9996,0),MATCH(K$4,$A$4:$F$4,0)),\"\")","v":1.5}]
[{"$f":"IF(ISNUMBER(B6),A5,\"\")","v":""},{"$f":"IF(ISNUMBER(E6),C6,\"\")","v":""},2,{"$f":"IF(E6=0,0,(E6*'Auction Simulation'!$B$40)/'Auction Simulation'!$B$41-1)","v":0},null,null,null,{"$f":"IF(H5>=$H$1,\"\",H5+1)","v":2},{"$f":"IF(ISNUMBER(H6),INDEX($A$3:$F$9996,MATCH('Auction Simulation'!$B$4&$H6,$A$3:$A$9996&$B$3:$B$9996,0),MATCH(I$4,$A$4:$F$4,0)),\"\")","v":6.1907545211604909E-2},{"$f":"IF(ISNUMBER(I6),INDEX($A$3:$F$9996,MATCH('Auction Simulation'!$B$4&$H6,$A$3:$A$9996&$B$3:$B$9996,0),MATCH(J$4,$A$4:$F$4,0)),\"\")","v":0.97404844290657433},{"$f":"IF(ISNUMBER(J6),INDEX($A$3:$F$9996,MATCH('Auction Simulation'!$B$4&$H6,$A$3:$A$9996&$B$3:$B$9996,0),MATCH(K$4,$A$4:$F$4,0)),\"\")","v":1.5}]
[{"$f":"IF(ISNUMBER(B7),A6,\"\")","v":""},"",3,{"$f":"IF(E7=0,0,(E7*'Auction Simulation'!$B$40)/'Auction Simulation'!$B$41-1)","v":0},null,null,null,3,{"$f":"IF(ISNUMBER(H7),INDEX($A$3:$F$9996,MATCH('Auction Simulation'!$B$4&$H7,$A$3:$A$9996&$B$3:$B$9996,0),MATCH(I$4,$A$4:$F$4,0)),\"\")","v":9.9630726213793652E-2},{"$f":"IF(ISNUMBER(I7),INDEX($A$3:$F$9996,MATCH('Auction Simulation'!$B$4&$H7,$A$3:$A$9996&$B$3:$B$9996,0),MATCH(J$4,$A$4:$F$4,0)),\"\")","v":1.0086505190311419},{"$f":"IF(ISNUMBER(J7),INDEX($A$3:$F$9996,MATCH('Auction Simulation'!$B$4&$H7,$A$3:$A$9996&$B$3:$B$9996,0),MATCH(K$4,$A$4:$F$4,0)),\"\")","v":1}]
["","",4,{"$f":"IF(E8=0,0,(E8*'Auction Simulation'!$B$40)/'Auction Simulation'!$B$41-1)","v":0},null,null,null,4,{"$f":"IF(ISNUMBER(H8),INDEX($A$3:$F$9996,MATCH('Auction Simulation'!$B$4&$H8,$A$3:$A$9996&$B$3:$B$9996,0),MATCH(I$4,$A$4:$F$4,0)),\"\")","v":0.13735390721598195},{"$f":"IF(ISNUMBER(I8),INDEX($A$3:$F$9996,MATCH('Auction Simulation'!$B$4&$H8,$A$3:$A$9996&$B$3:$B$9996,0),MATCH(J$4,$A$4:$F$4,0)),\"\")","v":1.0432525951557095},{"$f":"IF(ISNUMBER(J8),INDEX($A$3:$F$9996,MATCH('Auction Simulation'!$B$4&$H8,$A$3:$A$9996&$B$3:$B$9996,0),MATCH(K$4,$A$4:$F$4,0)),\"\")","v":0.2}]
["","",5,{"$f":"IF(E9=0,0,(E9*'Auction Simulation'!$B$40)/'Auction Simulation'!$B$41-1)","v":0},null,null,null,5,{"$f":"IF(ISNUMBER(H9),INDEX($A$3:$F$9996,MATCH('Auction Simulation'!$B$4&$H9,$A$3:$A$9996&$B$3:$B$9996,0),MATCH(I$4,$A$4:$F$4,0)),\"\")","v":0.13735390721598195},{"$f":"IF(ISNUMBER(I9),INDEX($A$3:$F$9996,MATCH('Auction Simulation'!$B$4&$H9,$A$3:$A$9996&$B$3:$B$9996,0),MATCH(J$4,$A$4:$F$4,0)),\"\")","v":1.0432525951557095},{"$f":"IF(ISNUMBER(J9),INDEX($A$3:$F$9996,MATCH('Auction Simulation'!$B$4&$H9,$A$3:$A$9996&$B$3:$B$9996,0),MATCH(K$4,$A$4:$F$4,0)),\"\")","v":0}]
["","",6,{"$f":"IF(E10=0,0,(E10*'Auction Simulation'!$B$40)/'Auction Simulation'!$B$41-1)","v":0},null,null,null,"",{"$f":"IF(ISNUMBER(H10),INDEX($A$3:$F$9996,MATCH('Auction Simulation'!$B$4&$H10,$A$3:$A$9996&$B$3:$B$9996,0),MATCH(I$4,$A$4:$F$4,0)),\"\")","v":""},{"$f":"IF(ISNUMBER(I10),INDEX($A$3:$F$9996,MATCH('Auction Simulation'!$B$4&$H10,$A$3:$A$9996&$B$3:$B$9996,0),MATCH(J$4,$A$4:$F$4,0)),\"\")","v":""},{"$f":"IF(ISNUMBER(J10),INDEX($A$3:$F$9996,MATCH('Auction Simulation'!$B$4&$H10,$A$3:$A$9996&$B$3:$B$9996,0),MATCH(K$4,$A$4:$F$4,0)),\"\")","v":""}]
["","",7,{"$f":"IF(E11=0,0,(E11*'Auction Simulation'!$B$40)/'Auction Simulation'!$B$41-1)","v":0},null,null,null,"",{"$f":"IF(ISNUMBER(H11),INDEX($A$3:$F$9996,MATCH('Auction Simulation'!$B$4&$H11,$A$3:$A$9996&$B$3:$B$9996,0),MATCH(I$4,$A$4:$F$4,0)),\"\")","v":""},{"$f":"IF(ISNUMBER(I11),INDEX($A$3:$F$9996,MATCH('Auction Simulation'!$B$4&$H11,$A$3:$A$9996&$B$3:$B$9996,0),MATCH(J$4,$A$4:$F$4,0)),\"\")","v":""},{"$f":"IF(ISNUMBER(J11),INDEX($A$3:$F$9996,MATCH('Auction Simulation'!$B$4&$H11,$A$3:$A$9996&$B$3:$B$9996,0),MATCH(K$4,$A$4:$F$4,0)),\"\")","v":""}]
["","",8,{"$f":"IF(E12=0,0,(E12*'Auction Simulation'!$B$40)/'Auction Simulation'!$B$41-1)","v":0},null,null,null,"",{"$f":"IF(ISNUMBER(H12),INDEX($A$3:$F$9996,MATCH('Auction Simulation'!$B$4&$H12,$A$3:$A$9996&$B$3:$B$9996,0),MATCH(I$4,$A$4:$F$4,0)),\"\")","v":""},{"$f":"IF(ISNUMBER(I12),INDEX($A$3:$F$9996,MATCH('Auction Simulation'!$B$4&$H12,$A$3:$A$9996&$B$3:$B$9996,0),MATCH(J$4,$A$4:$F$4,0)),\"\")","v":""},{"$f":"IF(ISNUMBER(J12),INDEX($A$3:$F$9996,MATCH('Auction Simulation'!$B$4&$H12,$A$3:$A$9996&$B$3:$B$9996,0),MATCH(K$4,$A$4:$F$4,0)),\"\")","v":""}]
["","",9,{"$f":"IF(E13=0,0,(E13*'Auction Simulation'!$B$40)/'Auction Simulation'!$B$41-1)","v":0},null,null,null,{"$f":"IF(H12>=$H$1,\"\",H12+1)","v":""},{"$f":"IF(ISNUMBER(H13),INDEX($A$3:$F$9996,MATCH('Auction Simulation'!$B$4&$H13,$A$3:$A$9996&$B$3:$B$9996,0),MATCH(I$4,$A$4:$F$4,0)),\"\")","v":""},{"$f":"IF(ISNUMBER(I13),INDEX($A$3:$F$9996,MATCH('Auction Simulation'!$B$4&$H13,$A$3:$A$9996&$B$3:$B$9996,0),MATCH(J$4,$A$4:$F$4,0)),\"\")","v":""},{"$f":"IF(ISNUMBER(J13),INDEX($A$3:$F$9996,MATCH('Auction Simulation'!$B$4&$H13,$A$3:$A$9996&$B$3:$B$9996,0),MATCH(K$4,$A$4:$F$4,0)),\"\")","v":""}]
["","",10,{"$f":"IF(E14=0,0,(E14*'Auction Simulation'!$B$40)/'Auction Simulation'!$B$41-1)","v":0},null,null,null,"",{"$f":"IF(ISNUMBER(H14),INDEX($A$3:$F$9996,MATCH('Auction Simulation'!$B$4&$H14,$A$3:$A$9996&$B$3:$B$9996,0),MATCH(I$4,$A$4:$F$4,0)),\"\")","v":""},{"$f":"IF(ISNUMBER(I14),INDEX($A$3:$F$9996,MATCH('Auction Simulation'!$B$4&$H14,$A$3:$A$9996&$B$3:$B$9996,0),MATCH(J$4,$A$4:$F$4,0)),\"\")","v":""},{"$f":"IF(ISNUMBER(J14),INDEX($A$3:$F$9996,MATCH('Auction Simulation'!$B$4&$H14,$A$3:$A$9996&$B$3:$B$9996,0),MATCH(K$4,$A$4:$F$4,0)),\"\")","v":""}]
[null,null,null,null,null,null,null,"",{"$f":"IF(ISNUMBER(H15),INDEX($A$3:$F$9996,MATCH('Auction Simulation'!$B$4&$H15,$A$3:$A$9996&$B$3:$B$9996,0),MATCH(I$4,$A$4:$F$4,0)),\"\")","v":""},{"$f":"IF(ISNUMBER(I15),INDEX($A$3:$F$9996,MATCH('Auction Simulation'!$B$4&$H15,$A$3:$A$9996&$B$3:$B$9996,0),MATCH(J$4,$A$4:$F$4,0)),\"\")","v":""},{"$f":"IF(ISNUMBER(J15),INDEX($A$3:$F$9996,MATCH('Auction Simulation'!$B$4&$H15,$A$3:$A$9996&$B$3:$B$9996,0),MATCH(K$4,$A$4:$F$4,0)),\"\")","v":""}]
[null,null,null,null,null,null,null,"",{"$f":"IF(ISNUMBER(H16),INDEX($A$3:$F$9996,MATCH('Auction Simulation'!$B$4&$H16,$A$3:$A$9996&$B$3:$B$9996,0),MATCH(I$4,$A$4:$F$4,0)),\"\")","v":""},{"$f":"IF(ISNUMBER(I16),INDEX($A$3:$F$9996,MATCH('Auction Simulation'!$B$4&$H16,$A$3:$A$9996&$B$3:$B$9996,0),MATCH(J$4,$A$4:$F$4,0)),\"\")","v":""},{"$f":"IF(ISNUMBER(J16),INDEX($A$3:$F$9996,MATCH('Auction Simulation'!$B$4&$H16,$A$3:$A$9996&$B$3:$B$9996,0),MATCH(K$4,$A$4:$F$4,0)),\"\")","v":""}]
[null,null,null,"Current VRR Curve",null,null,null,"",{"$f":"IF(ISNUMBER(H17),INDEX($A$3:$F$9996,MATCH('Auction Simulation'!$B$4&$H17,$A$3:$A$9996&$B$3:$B$9996,0),MATCH(I$4,$A$4:$F$4,0)),\"\")","v":""},{"$f":"IF(ISNUMBER(I17),INDEX($A$3:$F$9996,MATCH('Auction Simulation'!$B$4&$H17,$A$3:$A$9996&$B$3:$B$9996,0),MATCH(J$4,$A$4:$F$4,0)),\"\")","v":""},{"$f":"IF(ISNUMBER(J17),INDEX($A$3:$F$9996,MATCH('Auction Simulation'!$B$4&$H17,$A$3:$A$9996&$B$3:$B$9996,0),MATCH(K$4,$A$4:$F$4,0)),\"\")","v":""}]
[null,null,null,"Quantity (UCAP RM %)","Quantity (% of RR)","Price (% of Net Cone)",null,"",{"$f":"IF(ISNUMBER(H18),INDEX($A$3:$F$9996,MATCH('Auction Simulation'!$B$4&$H18,$A$3:$A$9996&$B$3:$B$9996,0),MATCH(I$4,$A$4:$F$4,0)),\"\")","v":""},{"$f":"IF(ISNUMBER(I18),INDEX($A$3:$F$9996,MATCH('Auction Simulation'!$B$4&$H18,$A$3:$A$9996&$B$3:$B$9996,0),MATCH(J$4,$A$4:$F$4,0)),\"\")","v":""},{"$f":"IF(ISNUMBER(J18),INDEX($A$3:$F$9996,MATCH('Auction Simulation'!$B$4&$H18,$A$3:$A$9996&$B$3:$B$9996,0),MATCH(K$4,$A$4:$F$4,0)),\"\")","v":""}]
["Current VRR Curve",1,1,{"$f":"IF(E19=0,0,(E19*'Auction Simulation'!$B$40)/'Auction Simulation'!$B$41-1)","v":0},0,1.5,null,"",{"$f":"IF(ISNUMBER(H19),INDEX($A$3:$F$9996,MATCH('Auction Simulation'!$B$4&$H19,$A$3:$A$9996&$B$3:$B$9996,0),MATCH(I$4,$A$4:$F$4,0)),\"\")","v":""},{"$f":"IF(ISNUMBER(I19),INDEX($A$3:$F$9996,MATCH('Auction Simulation'!$B$4&$H19,$A$3:$A$9996&$B$3:$B$9996,0),MATCH(J$4,$A$4:$F$4,0)),\"\")","v":""},{"$f":"IF(ISNUMBER(J19),INDEX($A$3:$F$9996,MATCH('Auction Simulation'!$B$4&$H19,$A$3:$A$9996&$B$3:$B$9996,0),MATCH(K$4,$A$4:$F$4,0)),\"\")","v":""}]
[{"$f":"IF(ISNUMBER(B20),A19,\"\")","v":"Current VRR Curve"},2,2,{"$f":"IF(E20=0,0,(E20*'Auction Simulation'!$B$40)/'Auction Simulation'!$B$41-1)","v":6.1907545211604909E-2},0.97404844290657433,1.5,null,"",{"$f":"IF(ISNUMBER(H20),INDEX($A$3:$F$9996,MATCH('Auction Simulation'!$B$4&$H20,$A$3:$A$9996&$B$3:$B$9996,0),MATCH(I$4,$A$4:$F$4,0)),\"\")","v":""},{"$f":"IF(ISNUMBER(I20),INDEX($A$3:$F$9996,MATCH('Auction Simulation'!$B$4&$H20,$A$3:$A$9996&$B$3:$B$9996,0),MATCH(J$4,$A$4:$F$4,0)),\"\")","v":""},{"$f":"IF(ISNUMBER(J20),INDEX($A$3:$F$9996,MATCH('Auction Simulation'!$B$4&$H20,$A$3:$A$9996&$B$3:$B$9996,0),MATCH(K$4,$A$4:$F$4,0)),\"\")","v":""}]
{"$rows_left_out":37}
{"sheet":"LOLE Data","index":5,"n_rows":21,"n_cols":14,"rows_kept":21,"cut":false,"hidden":false,"merged":[]}
[]
[null,"LOLE",null,null,null,"Quantities for LOLE Lines",null,null,null,null,"Lines for Chart"]
[null,"(events/yr)","(yr/event)","(1-in-X)",null,"(% of RR)","(% UCAP RM)","(UCAP MW)",null,null,null,null,"X","Y"]
[]
[]
[null,0.2,5,"1-in-5",null,0.98961244453077446,7.8875418707819778E-2,164401.84137878622,null,null,{"$f":"$D$6","v":"1-in-5"},null,{"$f":"INDEX($H$6:$H$21,MATCH($K6,$D$6:$D$21,0))","v":164401.84137878622},0]
[null,0.16666666666666666,6,"1-in-6",null,0.99233271979212923,8.1841062609949722E-2,164853.75390726695,null,null,{"$f":"K6","v":"1-in-5"},null,{"$f":"INDEX($H$6:$H$21,MATCH($K7,$D$6:$D$21,0))","v":164401.84137878622},600]
[null,0.14285714285714285,7,"1-in-7",null,0.99463267975423619,8.4348478801856919E-2,165235.84050587186]
[null,0.125,8,"1-in-8",null,0.99662499569513885,8.65205015030861E-2,165566.81897234419,null,null,{"$f":"$D$11","v":"1-in-10"},null,{"$f":"INDEX($H$6:$H$21,MATCH($K9,$D$6:$D$21,0))","v":166119.91520661194},0]
[null,0.1111111111111111,9,"1-in-9",null,0.99838234289937211,8.843636130381971E-2,165858.76267001545,null,null,{"$f":"K9","v":"1-in-10"},null,{"$f":"INDEX($H$6:$H$21,MATCH($K10,$D$6:$D$21,0))","v":166119.91520661194},600]
[null,0.1,10,"1-in-10",null,0.99995434354102686,9.0150156294825923E-2,166119.91520661194]
[null,6.6666666666666666E-2,15,"1-in-15",null,1.0060039666482696,9.6745454988695689E-2,167124.92396936042,null,null,{"$f":"$D$21","v":"1-in-100"},null,{"$f":"INDEX($H$6:$H$21,MATCH($K12,$D$6:$D$21,0))","v":171827.23292435677},0]
[null,0.05,20,"1-in-20",null,1.0102962425512791,0.10142489388183185,167837.98903443763,null,null,{"$f":"K12","v":"1-in-100"},null,{"$f":"INDEX($H$6:$H$21,MATCH($K13,$D$6:$D$21,0))","v":171827.23292435677},600]
[null,3.3333333333333333E-2,30,"1-in-30",null,1.016345865658522,0.10802019257570161,168842.99779718611]
[null,2.5000000000000001E-2,40,"1-in-40",null,1.0206381415615313,0.11269963146883755,169556.06286226329]
[null,0.02,50,"1-in-50",null,1.0239674894074193,0.11632928626057715,170109.15909653105]
[null,1.6666666666666666E-2,60,"1-in-60",null,1.0266877646687744,0.11929493016270776,170561.07162501183]
[null,1.4285714285714285E-2,70,"1-in-70",null,1.0289877246308814,0.12180234635461495,170943.15822361675]
[null,1.2500000000000001E-2,80,"1-in-80",null,1.0309800405717837,0.12397436905584369,171274.13669008901]
[null,1.1111111111111112E-2,90,"1-in-90",null,1.0327373877760173,0.12589022885657752,171566.0803877603]
{"$rows_left_out":1}